EasyCwmp

View Issue Details Jump to Notes ] Issue History ] Print ]
IDProjectCategoryView StatusDate SubmittedLast Update
0000383easycwmp[All Projects] Helppublic2019-07-10 23:302019-07-10 23:30
Reporterdarkingdoom 
Assigned To 
PriorityhighSeverityminorReproducibilityalways
StatusnewResolutionopen 
PlatformLinuxOSUbuntuOS Version18.04
Summary0000383: Error on compiling : cannot find appropriate hash command, ensure the provided hash is either a MD5 or SHA256 checksum
DescriptionHey,
I am trying Easycwmp for openWER by following the following wiki
http://easycwmp.org/tutorial/ [^]
Tried to compile the OpenWRT without the EasyWCMP and it compiles as it should, now after adding the EasyWCMP package and then compile i get the following error
Cannot find appropriate hash command, ensure the provided hash is either a MD5 or SHA256 checksum.

Full log is attached
Steps To ReproduceDownload OpenWRT 18.06
compile it according to this
https://github.com/openwrt/openwrt/tree/openwrt-18.06 [^]
Download EasyWCMP for OPenWRT from here
http://easycwmp.org/get/ [^]
Add it according to this Wiki
http://easycwmp.org/tutorial/ [^]
Additional Informationtester@tester-VirtualBox:~/Downloads/new/openwrt-openwrt-18.06$ make package/easycwmp/compile
 make[1] package/easycwmp/compile
 make[2] -C package/libs/toolchain compile
 make[2] -C package/libmicroxml compile
 make[2] -C package/libs/libjson-c compile
 make[2] -C package/utils/lua compile
 make[2] -C package/libs/libubox compile
 make[2] -C package/system/ca-certificates compile
 make[2] -C package/libs/mbedtls compile
 make[2] -C package/network/utils/curl compile
 make[2] -C package/system/ubus compile
 make[2] -C package/system/uci compile
 make[2] -C package/easycwmp compile
make -r package/easycwmp/compile: build failed. Please re-run make with -j1 V=s or V=sc for a higher verbosity level to see what's going on
make: *** [/home/tester/Downloads/new/openwrt-openwrt-18.06/include/toplevel.mk:218: package/easycwmp/compile] Error 1
tester@tester-VirtualBox:~/Downloads/new/openwrt-openwrt-18.06$ make package/easycwmp/compile V=sc
make[1]: Entering directory '/home/tester/Downloads/new/openwrt-openwrt-18.06'
make[2]: Entering directory '/home/tester/Downloads/new/openwrt-openwrt-18.06/package/libs/toolchain'
echo "libc" >> /home/tester/Downloads/new/openwrt-openwrt-18.06/staging_dir/target-arm_arm1176jzf-s+vfp_musl_eabi/pkginfo/toolchain.default.install
echo "libgcc" >> /home/tester/Downloads/new/openwrt-openwrt-18.06/staging_dir/target-arm_arm1176jzf-s+vfp_musl_eabi/pkginfo/toolchain.default.install
echo "libpthread" >> /home/tester/Downloads/new/openwrt-openwrt-18.06/staging_dir/target-arm_arm1176jzf-s+vfp_musl_eabi/pkginfo/toolchain.default.install
echo "librt" >> /home/tester/Downloads/new/openwrt-openwrt-18.06/staging_dir/target-arm_arm1176jzf-s+vfp_musl_eabi/pkginfo/toolchain.default.install
make[2]: Leaving directory '/home/tester/Downloads/new/openwrt-openwrt-18.06/package/libs/toolchain'
time: package/libs/toolchain/compile#0.19#0.08#0.27
make[2]: Entering directory '/home/tester/Downloads/new/openwrt-openwrt-18.06/package/libmicroxml'
make[2]: Leaving directory '/home/tester/Downloads/new/openwrt-openwrt-18.06/package/libmicroxml'
time: package/libmicroxml/compile#0.19#0.04#0.24
make[2]: Entering directory '/home/tester/Downloads/new/openwrt-openwrt-18.06/package/libs/libjson-c'
echo "libjson-c" >> /home/tester/Downloads/new/openwrt-openwrt-18.06/staging_dir/target-arm_arm1176jzf-s+vfp_musl_eabi/pkginfo/libjson-c.default.install
make[2]: Leaving directory '/home/tester/Downloads/new/openwrt-openwrt-18.06/package/libs/libjson-c'
time: package/libs/libjson-c/compile#0.23#0.07#0.29
make[2]: Entering directory '/home/tester/Downloads/new/openwrt-openwrt-18.06/package/utils/lua'
make[2]: Leaving directory '/home/tester/Downloads/new/openwrt-openwrt-18.06/package/utils/lua'
time: package/utils/lua/compile#0.22#0.07#0.31
make[2]: Entering directory '/home/tester/Downloads/new/openwrt-openwrt-18.06/package/libs/libubox'
echo "libubox" >> /home/tester/Downloads/new/openwrt-openwrt-18.06/staging_dir/target-arm_arm1176jzf-s+vfp_musl_eabi/pkginfo/libubox.default.install
echo "libblobmsg-json" >> /home/tester/Downloads/new/openwrt-openwrt-18.06/staging_dir/target-arm_arm1176jzf-s+vfp_musl_eabi/pkginfo/libubox.default.install
echo "jshn" >> /home/tester/Downloads/new/openwrt-openwrt-18.06/staging_dir/target-arm_arm1176jzf-s+vfp_musl_eabi/pkginfo/libubox.default.install
echo "libjson-script" >> /home/tester/Downloads/new/openwrt-openwrt-18.06/staging_dir/target-arm_arm1176jzf-s+vfp_musl_eabi/pkginfo/libubox.default.install
make[2]: Leaving directory '/home/tester/Downloads/new/openwrt-openwrt-18.06/package/libs/libubox'
time: package/libs/libubox/compile#0.79#0.26#1.05
make[2]: Entering directory '/home/tester/Downloads/new/openwrt-openwrt-18.06/package/system/ca-certificates'
make[2]: Leaving directory '/home/tester/Downloads/new/openwrt-openwrt-18.06/package/system/ca-certificates'
time: package/system/ca-certificates/compile#0.21#0.04#0.25
make[2]: Entering directory '/home/tester/Downloads/new/openwrt-openwrt-18.06/package/libs/mbedtls'
make[2]: Leaving directory '/home/tester/Downloads/new/openwrt-openwrt-18.06/package/libs/mbedtls'
time: package/libs/mbedtls/compile#0.20#0.08#0.26
make[2]: Entering directory '/home/tester/Downloads/new/openwrt-openwrt-18.06/package/network/utils/curl'
make[2]: Leaving directory '/home/tester/Downloads/new/openwrt-openwrt-18.06/package/network/utils/curl'
time: package/network/utils/curl/compile#0.28#0.07#0.32
make[2]: Entering directory '/home/tester/Downloads/new/openwrt-openwrt-18.06/package/system/ubus'
echo "libubus" >> /home/tester/Downloads/new/openwrt-openwrt-18.06/staging_dir/target-arm_arm1176jzf-s+vfp_musl_eabi/pkginfo/ubus.default.install
echo "ubus" >> /home/tester/Downloads/new/openwrt-openwrt-18.06/staging_dir/target-arm_arm1176jzf-s+vfp_musl_eabi/pkginfo/ubus.default.install
echo "ubusd" >> /home/tester/Downloads/new/openwrt-openwrt-18.06/staging_dir/target-arm_arm1176jzf-s+vfp_musl_eabi/pkginfo/ubus.default.install
make[2]: Leaving directory '/home/tester/Downloads/new/openwrt-openwrt-18.06/package/system/ubus'
time: package/system/ubus/compile#0.58#0.24#0.83
make[2]: Entering directory '/home/tester/Downloads/new/openwrt-openwrt-18.06/package/system/uci'
echo "uci" >> /home/tester/Downloads/new/openwrt-openwrt-18.06/staging_dir/target-arm_arm1176jzf-s+vfp_musl_eabi/pkginfo/uci.default.install
echo "libuci" >> /home/tester/Downloads/new/openwrt-openwrt-18.06/staging_dir/target-arm_arm1176jzf-s+vfp_musl_eabi/pkginfo/uci.default.install
make[2]: Leaving directory '/home/tester/Downloads/new/openwrt-openwrt-18.06/package/system/uci'
time: package/system/uci/compile#0.53#0.22#0.75
make[2]: Entering directory '/home/tester/Downloads/new/openwrt-openwrt-18.06/package/easycwmp'
mkdir -p /home/tester/Downloads/new/openwrt-openwrt-18.06/dl
SHELL= flock /home/tester/Downloads/new/openwrt-openwrt-18.06/tmp/.easycwmp-1.8.1.tar.gz.flock -c ' /home/tester/Downloads/new/openwrt-openwrt-18.06/scripts/download.pl "/home/tester/Downloads/new/openwrt-openwrt-18.06/dl" "easycwmp-1.8.1.tar.gz" "x" "" "http://easycwmp.org/download/" [^] '
Cannot find appropriate hash command, ensure the provided hash is either a MD5 or SHA256 checksum.
make[2]: *** [Makefile:107: /home/tester/Downloads/new/openwrt-openwrt-18.06/dl/easycwmp-1.8.1.tar.gz] Error 255
make[2]: Leaving directory '/home/tester/Downloads/new/openwrt-openwrt-18.06/package/easycwmp'
time: package/easycwmp/compile#0.21#0.08#0.31
make[1]: *** [package/Makefile:109: package/easycwmp/compile] Error 2
make[1]: Leaving directory '/home/tester/Downloads/new/openwrt-openwrt-18.06'
make: *** [/home/tester/Downloads/new/openwrt-openwrt-18.06/include/toplevel.mk:218: package/easycwmp/compile] Error 2
TagsNo tags attached.
Attached Filestxt file icon log.txt [^] (6,706 bytes) 2019-07-10 23:30 [Show Content]

- Relationships

-  Notes
There are no notes attached to this issue.

- Issue History
Date Modified Username Field Change
2019-07-10 23:30 darkingdoom New Issue
2019-07-10 23:30 darkingdoom File Added: log.txt


Copyright © 2000 - 2019 MantisBT Team
Powered by Mantis Bugtracker